�A�g�{�݂P,�A�g�{�݂Q,�ʒu�t��,��v��Éۑ�,�a�����i���j,���ȍL��,���ȑ��,���ȋ,���Ȗn��,���ȑ�������,���ȑ�v��,���ȑ����k,���ȉ`��,���ȖL��,�O�Ȗn��,�O�ȑ�������,���`�O�ȑ�������,�畆�Ȗn��,���@��A�ȑ�������,��A��ȋ,�Y�w�l�ȑ�������,�����ȑ��,�����Ȗn��,�����ȏ�������,���_�Ȗn��,���_�ȑ�������,���_�ȏ�������,���_�ȏ���,���_�ȖL��,�����ȍL��,�����ȑ��,�����ȋ,�����Ȗn��,�����ȑ�������,�����ȓ���,�����ȉ`��,�����ȖL��,���ː��ȋ,�a���,�a����������,�~�}�Ȗn��,�~�}�ȑ�������,�����f�ÍL��,�����f�Ön��,�����f�Ñ�������,�����f�Ë
�s���E���Еa�@,�L���a�@,�~�}�E�ЊQ��ÃZ���^�[,�O���~�}��ÁE�����d�q�A�������ÁA�S���a��ÁA�]���ǎ������,478,�|,��,,��,��,��,,,��,��,��,��,��,,,,,,��,,,,��,,�|,��,��,��,��,��,��,��,,��,,,,�|,,,��
�s���E���Еa�@,��˕a�@,��q�E���E�}�`��ÃZ���^�[,���Y���E���n����ÁA���E�}�`�P���a��ÁA��Q�ҍ����ǈ�ÁA���n�r���e�[�V�������,508,��,�|,��,��,��,��,,��,��,��,,,��,,��,��,�|,,��,,,,��,,��,�|,��,��,��,��,��,��,��,,,,,,,,
�s���E���Еa�@,��a�@,����E�����ǈ�ÃZ���^�[,�����ÁA�����ǈ�ÁA�������זE�ڐA���,833,��,��,�|,��,��,��,,��,��,��,��,��,��,,�|,,,,,,,,��,,��,��,�|,��,��,��,��,��,�|,�|,,,,,,,�|
�s���E���Еa�@,�n���a�@,�~�}�E������ÃZ���^�[,�O���~�}��ÁE�����d�q�A���Y���E���n����ÁA���_�ȋ~�}��ÁA�����ǈ�ÁA�S���a��ÁA���E�}�`�P���a��ÁA���n�r���e�[�V�������,765,��,��,��,�|,,��,,��,��,�|,,��,�|,,��,,,�|,,�|,,,��,,��,��,��,�|,��,��,��,��,,��,,�|,,,�|,,
�s���E���Еa�@,����������ÃZ���^�[,����������ÃZ���^�[,�O���~�}��ÁE�����d�q�A���Y���i�Y�ȕ���j�A���j��ÁA���_�ȋ~�}��ÁA�����ÁA��a��ÁA�������זE�ڐA��Ái�����ڐA�j�A��Q�Ҏ��Ȉ�ÁA�S���a��ÁA�]���ǎ�����ÁA��僊�n�r���e�[�V������ÁA�L�����[�I�[�o�[��Ái�ڍs����Áj,789,��,��,��,,�|,��,��,,��,,�|,�|,��,�|,��,�|,,,,,�|,��,��,,��,��,��,��,�|,��,��,��,��,,�|,,�|,,,�|,
�s���E���Еa�@,�_�o�a�@,�]�E�_�o��a��ÃZ���^�[,�_�o�E�ؓ�a���܂ޔ]�_�o�n�������,304,��,��,��,,��,��,��,��,,,,,,��,,,,,,,,,,,��,��,��,��,��,��,��,��,,,��,,,,,,
�s���E���Еa�@,����������ÃZ���^�[,����������ÃZ���^�[,��������ÁA�����~�}��ÁA�������_��ÁA���Y����Ái�V��������j�A�������j��ÁA������a��ÁA�����������זE�ڐA��Ái�����ڐA�j�A��������ڐA��ÁA�v�t����ÁA��Q�Ҏ��Ȉ�ÁA�L�����[�I�[�o�[��Ái�ڍs����Áj�A���B��Q���,561,,,,,,,,,,��,��,��,,��,��,,��,��,�|,��,��,�|,��,��,��,��,��,��,��,��,��,��,��,,��,��,��,,,��,��
�s���E���Еa�@,����a�@,���_��ÃZ���^�[,���_�ȋ~�}��ÁA���_�Ȑg�̍����ǈ��,898,,��,��,,��,��,��,��,,,,,,,,,,,,��,��,��,�|,��,,,,,,,,,,,,,,,,,
�s���E���Еa�@,�����n��a�@,�擌���n��a�@,�~�}��ÁA�z����,314,,,,��,,��,,,,��,,,,,,,,,,,,,,,��,��,��,��,��,��,��,��,,,,,,,,,
�s���E���Еa�@,�����암�n��a�@,�쑽���n��a�@,�~�}��ÁA������,318,,,,,��,��,��,,,,,,��,,��,,,,,,,,,,,,,,,,,,,,,,,,,,
�s���E���Еa�@,��v�ەa�@,�搼���n��a�@,�~�}��ÁA�����K���a�A�t��Ái���́A�t�ڐA�j�A�]������ÁA�z���ÁA������,304,��,,,,��,�|,,��,��,,��,,,,,,,,,,,,,,,,,,,,,,,��,,,,,,,
�s���E���Еa�@,�����k����ÃZ���^�[,�k�����k���n��a�@,�~�}��ÁA������,344,,,,,��,,�|,,,,��,,,,��,,,,��,,,,,,��,��,��,��,��,�|,��,��,,,��,,,,,,
�s���E���Еa�@,�`���a�@,��암�n��a�@,�~�}��ÁA�W�w�I�����ÁA�]���ǎ������,506,,,��,��,,��,,�|,,��,,,��,,,,,,��,,,,��,,��,��,��,��,��,��,�|,��,��,,,,,,,,
�s���E���Еa�@,�L���a�@,�搼�k���n��a�@,�ɘa�P�A�A���_�ȋ~�}��ÁA�����ǈ�ÁA���Y���E���n����ÁA���n�r���e�[�V������ÁA���A�a��ÁA�A�����M�[���,470,��,��,��,��,��,��,,,�|,��,,,,,��,,,,��,,,,��,�|,��,��,��,��,��,��,��,�|,,��,,,,,,,
�s���E���ЈȊO�̕a�@,,���C�{�݌Q�ɂ́A���ʘA�g�{�݂⋦�͕a�@���܂܂�Ă��܂��B�^�k�����哙�l�^���������ېf�Ï��A�V�������ۖ{���f�Ï��A�V�������ێ������f�Ï��A�_�Ó������ے��c�f�Ï��A�O����ے��c�����f�Ï��A�䑠�����ے��c�䑠���f�Ï��A���������ې������f�Ï��A���}���������}�����f�Ï��A���}���������}�����꓇�f�Ï��A�w�������۞w���f�Ï��A�����������ۉ������a�@,,,�������ϕa�@,������Ȏ��ȑ�w��w���t���a�@,�������񌤋��Z���^�[�����a�@,������Ȏ��ȑ�w��w���t���a�@,�~�s�������a�@,�������q��ȑ�w�a�@,�������a�a�@,���M��w��ÃZ���^�[��X�a�@,������Ȏ��ȑ�w��w���t���a�@,�����哙,������w��w���t���a�@,������w��w���t���a�@,,�Ղ̖�a�@,�~�s�������a�@,������Ȏ��ȑ�w��w���t���a�@,���{��w��w���t�����a�@,���H�����ەa�@,���쑊�ݕa�@,������Ȏ��ȑ�w��w���t���a�@,�����s���N������ÃZ���^�[,���������Εa�@,������Ȏ��ȑ�w��w���t���a�@,�����s���N������ÃZ���^�[,,�c��`�m��w�a�@,���V����w��w���������V����@,���V����w��w���������V����@,������Ȏ��ȑ�w��w���t���a�@,���V����w��w���������V����@,���a��w�a�@,���V����w��w���������V����@,�����s���񌟐f�Z���^�[,������Ȏ��ȑ�w��w���t���a�@,�������a�a�@,������w��w���t���a�@,���a��w�a�@,�哇��ÃZ���^�[,�����铌�a�@,���������������N���j�b�N,���������a�@
�s���E���ЈȊO�̕a�@,,���C�{�݌Q�ɂ́A���ʘA�g�{�݂⋦�͕a�@���܂܂�Ă��܂��B�^�k�����哙�l�^���������ېf�Ï��A�V�������ۖ{���f�Ï��A�V�������ێ������f�Ï��A�_�Ó������ے��c�f�Ï��A�O����ے��c�����f�Ï��A�䑠�����ے��c�䑠���f�Ï��A���������ې������f�Ï��A���}���������}�����f�Ï��A���}���������}�����꓇�f�Ï��A�w�������۞w���f�Ï��A�����������ۉ������a�@,,,���{��w��w���t�����a�@,�����哙,�m�s�s�����{�֓��a�@,�}�g�L�O�a�@,����s���a�@,������Ȏ��ȑ�w��w���t���a�@,�匴�L�O�a�@,�����哙,���{��w��w���t�����a�@,,��t��w��w�������a�@,������ȑ�w�t���a�@,,,�����k��ÃZ���^�[,�Ǘё�w��w���t���a�@,�c��`�m��w�a�@,�����哙,�����哙,,�~�s�������a�@,,������w��w���t���a�@,�������_�E�_�o��Ì����Z���^�[�a�@,,���v��������a�@,,���F��C���X�����n�[�g�Z���^�[,���������Ì����Z���^�[,,���F��C���X�����n�[�g�Z���^�[,���{��w��w���t�����a�@,,,�����s���񌟐f�Z���^�[,�������M�a�@,���v�����a�@�i���쌧�j,���}�����f�Ï�,�N���j�b�N��z,�����哙,��򐶋��a�@
�s���E���ЈȊO�̕a�@,,���C�{�݌Q�ɂ́A���ʘA�g�{�݂⋦�͕a�@���܂܂�Ă��܂��B�^�k�����哙�l�^���������ېf�Ï��A�V�������ۖ{���f�Ï��A�V�������ێ������f�Ï��A�_�Ó������ے��c�f�Ï��A�O����ے��c�����f�Ï��A�䑠�����ے��c�䑠���f�Ï��A���������ې������f�Ï��A���}���������}�����f�Ï��A���}���������}�����꓇�f�Ï��A�w�������۞w���f�Ï��A�����������ۉ������a�@,,,������Ȏ��ȑ�w��w���t���a�@,,���������a�@,�����L�O�a�@,�����s���N������ÃZ���^�[,�V�n�ˋL�O���쑍���a�@,���\���a�@,,�����s���N������ÃZ���^�[,,�����哙,�����a�@�i�É����j,,,�ו���@,�~�s�������a�@,�����哙,,,,������ԏ\���a�@,,�c��`�m��w�a�@,�Вc����������a�@,,,,,���H�����ەa�@,,,�������q��ȑ�w�a�@,,,,,���{�ԏ\���Ј�ÃZ���^�[,�_�Ó��f�Ï�,�^���^���a�@,,�����哙
�s���E���ЈȊO�̕a�@,,���C�{�݌Q�ɂ́A���ʘA�g�{�݂⋦�͕a�@���܂܂�Ă��܂��B�^�k�����哙�l�^���������ېf�Ï��A�V�������ۖ{���f�Ï��A�V�������ێ������f�Ï��A�_�Ó������ے��c�f�Ï��A�O����ے��c�����f�Ï��A�䑠�����ے��c�䑠���f�Ï��A���������ې������f�Ï��A���}���������}�����f�Ï��A���}���������}�����꓇�f�Ï��A�w�������۞w���f�Ï��A�����������ۉ������a�@,,,�������a�a�@,,��򐶋��a�@,�����哙,�����a�@�@�\�����a�@,�����哙,�����a�@�@�\�����a�@,,�R�胁�f�B�J���Z���^�[,,,���a�a�@�i�_�ސ쌧�j,,,�����哙,���쑊�ݕa�@,,,,,�����a�@,,���a��w�a�@,�Вc����z�a�a�@,,,,,�É��������ǂ��a�@,,,,,,,,���a��w�����u�a�@,,�����哙,,
�s���E���ЈȊO�̕a�@,,���C�{�݌Q�ɂ́A���ʘA�g�{�݂⋦�͕a�@���܂܂�Ă��܂��B�^�k�����哙�l�^���������ېf�Ï��A�V�������ۖ{���f�Ï��A�V�������ێ������f�Ï��A�_�Ó������ے��c�f�Ï��A�O����ے��c�����f�Ï��A�䑠�����ے��c�䑠���f�Ï��A���������ې������f�Ï��A���}���������}�����f�Ï��A���}���������}�����꓇�f�Ï��A�w�������۞w���f�Ï��A�����������ۉ������a�@,,,�����哙,,�V�n�ˋL�O���쑍���a�@,,���ۈ������a�@,,�����哙,,�V�n�ˋL�O���쑍���a�@,,,�����哙,,,,�c���s�s���f�B�[�X�N���j�b�N,,,,,�����s�������������_�ی������Z���^�[,,�������ۈ�Ì����Z���^�[�a�@,��������������a�@,,,,,�匴�L�O�a�@,,,,,,,,,,,,
�s���E���ЈȊO�̕a�@,,���C�{�݌Q�ɂ́A���ʘA�g�{�݂⋦�͕a�@���܂܂�Ă��܂��B�^�k�����哙�l�^���������ېf�Ï��A�V�������ۖ{���f�Ï��A�V�������ێ������f�Ï��A�_�Ó������ے��c�f�Ï��A�O����ے��c�����f�Ï��A�䑠�����ے��c�䑠���f�Ï��A���������ې������f�Ï��A���}���������}�����f�Ï��A���}���������}�����꓇�f�Ï��A�w�������۞w���f�Ï��A�����������ۉ������a�@,,,,,�Ó슙�q�����a�@,,�������a�a�@,,,,�~�s�������a�@,,,,,,,,,,,,,,�����s���N������ÃZ���^�[,������c���a�@,,,,,,,,,,,,,,,,,
�s���E���ЈȊO�̕a�@,,���C�{�݌Q�ɂ́A���ʘA�g�{�݂⋦�͕a�@���܂܂�Ă��܂��B�^�k�����哙�l�^���������ېf�Ï��A�V�������ۖ{���f�Ï��A�V�������ێ������f�Ï��A�_�Ó������ے��c�f�Ï��A�O����ے��c�����f�Ï��A�䑠�����ے��c�䑠���f�Ï��A���������ې������f�Ï��A���}���������}�����f�Ï��A���}���������}�����꓇�f�Ï��A�w�������۞w���f�Ï��A�����������ۉ������a�@,,,,,������Ȏ��ȑ�w��w�������a�@,,�����哙,,,,�����哙,,,,,,,,,,,,,,�����s�������������_�ی������Z���^�[,�������񌤋��Z���^�[�����a�@,,,,,,,,,,,,,,,,,
�s���E���ЈȊO�̕a�@,,���C�{�݌Q�ɂ́A���ʘA�g�{�݂⋦�͕a�@���܂܂�Ă��܂��B�^�k�����哙�l�^���������ېf�Ï��A�V�������ۖ{���f�Ï��A�V�������ێ������f�Ï��A�_�Ó������ے��c�f�Ï��A�O����ے��c�����f�Ï��A�䑠�����ے��c�䑠���f�Ï��A���������ې������f�Ï��A���}���������}�����f�Ï��A���}���������}�����꓇�f�Ï��A�w�������۞w���f�Ï��A�����������ۉ������a�@,,,,,�����哙,,,,,,,,,,,,,,,,,,,,,,,,,,,,,,,,,,,,,,
