�����̓�,�ƍߓ��v�^�ߎ�^����,�ƍߓ��v�^�ߎ�^������,�ƍߓ��v�^�ߎ�^�E�l,�ƍߓ��v�^�ߎ�^����,�ƍߓ��v�^�ߎ�^����,�ƍߓ��v�^�ߎ�^�e�\��,�ƍߓ��v�^�ߎ�^�\�s��Q,�ƍߓ��v�^�ߎ�^��������,�ƍߓ��v�^�ߎ�^�ޓ�,�ƍߓ��v�^�ߎ�^�S�Ă̐N����,�ƍߓ��v�^�ߎ�^�Z��N����,�ƍߓ��v�^�ߎ�^��N����,�ƍߓ��v�^�ߎ�^�Ђ�������,�ƍߓ��v�^�ߎ�^�ԏ�˂炢,�ƍߓ��v�^�ߎ�^��蕨��,�ƍߓ��v�^�ߎ�^�����ԓ�,�ƍߓ��v�^�ߎ�^�I�[�g�o�C��,�ƍߓ��v�^�ߎ�^���]�ԓ�,�ƍߓ��v�^�ߎ�^�u������,�ƍߓ��v�^�ߎ�^����,�ƍߓ��v�^�ߎ�^�함����,�ƍߓ��v�^�ߎ�^���\,�ƍߓ��v�^�ߎ�^���ꍼ�\,�ƍߓ��v�^�ߎ�^����,�ƍߓ��v�^�ߎ�^�q���ւ̔ƍ�,�ƍߓ��v�^�ߎ�^���ƍ�,�ƍߓ��v�^�ߎ�^���R�킢����,�ƍߓ��v�^���ԁ^�N,�ƍߓ��v�^���ԁ^��,�ƍߓ��v�^���ԁ^�T,�ƍߓ��v�^���ԁ^�s,�ƍߓ��v�^�͈́^��s�S��,�ƍߓ��v�^�͈́^�x�@��,�ƍߓ��v�^�͈́^��w,�ƍߓ��v�^�͈́^������,�ƍߓ��v�^�`���^�o�c�e,�ƍߓ��v�^�`���^�g�o��肱��,�ƍߓ��v�^�`���^�d��������,�x�����E�x�@���ւ̃����N,���ӊ��N�^����,���ӊ��N�^���]�ԓ�,���ӊ��N�^�I�[�g�o�C��,���ӊ��N�^�ԏ゠�炵,���ӊ��N�^�Ђ�������,���ӊ��N�^����,���ӊ��N�^�X�g�[�J�[,���ӊ��N�^�s�R�ҏ��E�h�Ə��,���ӊ��N�^���ꍼ�\,���ӊ��N�^�Z��̖h��,���ӊ��N�^�P�P�O�Ԃ̂�����,���ӊ��N�^���ƍ�,���ӊ��N�^�q�������Ăт�������,���E��g���^��ᓙ�^���S�s�s�錾,���E��g���^��ᓙ�^�������S���,���E��g���^��ᓙ�^�x�@���Ƃ̊o����,���E��g���^��ᓙ�^�\�͒c�r�����,���E��g���^�����̂�n�擙�̎�g�^���ɂ��p�g���[��,���E��g���^�����̂�n�擙�̎�g�^����I�Ȗh�Ɗ���,���E��g���^�����̂�n�擙�̎�g�^���S�E���S�X�e�[�V����,���E��g���^�����̂�n�擙�̎�g�^�q���P�P�O�Ԃ̉�,���E��g���^�����̂�n�擙�̎�g�^�h�ƃJ�����ݒu���ᓙ,���E��g���^�����̂�n�擙�̎�g�^���򉻁E����������,���E��g���^�����̂�n�擙�̎�g�^�n����S�}�b�v,���E��g���^�����̂�n�擙�̎�g�^���]�ԓ��L�����y�[��,���E��g���^�����̂�n�擙�̎�g�^�h�ƍu�a,���E��g���^�⏕�E�ݗ^���^�h�Ɗ��������i,���E��g���^�⏕�E�ݗ^���^�h�ƃJ�����⏕��,���E��g���^�⏕�E�ݗ^���^�Z��̖h�Ƒ΍��⏕,���E��g���^�⏕�E�ݗ^���^�����Ԓʘb�^���@,���E��g���^�⏕�E�ݗ^���^�h�ƃu�U�[,���E��g���^�⏕�E�ݗ^���^�����������i�����ܓ��j,�����̓�
�����s,��,��,��,��,��,��,��,��,��,��,,��,,��,,��,��,��,,��,,��,��,��,,,��,��,��,,��,��,��,,,,��,��,��,,,,,,��,��,,��,��,,,,,��,,��,��,��,,��,��,��,��,,��,��,��,,��,,��,�����s
�x����,��,��,��,��,��,��,��,��,��,��,��,��,��,��,��,��,��,��,��,��,��,��,��,��,,��,��,��,��,,��,��,��,,,��,��,��,,,��,��,��,��,��,��,��,��,��,,��,,,,,,,,,��,��,��,,,,,,,,,,�x����
���c��,��,��,��,��,��,��,��,��,��,��,,��,,,,,,,,,��,��,,��,,,��,��,,,,��,,,,��,,��,��,,,,,,,,��,��,,,,,,��,��,��,��,��,,��,,��,,,��,��,��,,,,,���c��
������,��,,,,,,,,,��,��,,��,��,��,,,,��,,,,,,,,,��,,,,,,��,,��,��,,,,,,,��,,,��,��,��,,,,,��,��,��,,,,,,,,,��,��,��,��,��,,,������
�`��,��,��,,,,��,,,,��,,��,��,��,,,,,��,��,,,,,,,,��,,,,��,,,,��,��,,��,,��,,,��,,,��,��,,,,,,��,��,��,��,��,,,,��,��,,,��,��,��,��,��,��,�`��
�V�h��,��,��,,,,��,,,��,��,��,��,��,��,��,��,��,��,��,,,,,,,,,��,,,,��,,,��,��,,,��,��,,,,,��,,��,��,,��,,��,,��,��,��,,��,��,��,��,��,��,,,,,,��,��,��,�V�h��
������,��,��,��,��,��,��,��,��,��,��,,��,,,,,,,,,��,��,,��,,,��,��,,,,��,,,,��,,��,��,,,,,,,,,��,,,,,,��,��,��,��,��,,,,,��,,,��,��,,��,��,��,������
�䓌��,,,,,,,,,,,,,,,,,,,,,,,,,,,,,,,,,,,,,,,��,,��,��,,��,,,��,��,��,,,,,��,��,��,��,��,,��,,,,,��,��,��,,,��,,�䓌��
�n�c��,,��,��,��,��,��,��,��,��,,,,,,,,,,,,,��,,,,��,,��,,,,��,��,,,��,,,��,,,,,,,,��,��,,,,,,��,��,��,��,��,��,,,,��,,��,��,��,,,��,,�n�c��
�]����,��,,,��,,��,,,,��,,,��,��,,��,��,��,,��,,,,,,,��,��,,,,,��,,,,��,,��,��,��,,,��,��,,��,��,,,,,,��,��,��,��,��,,��,,,��,,��,��,��,,��,,,�]����
�i���,��,��,��,��,��,��,��,��,��,��,��,��,,,,,,,,,,��,,,,,��,��,,,,��,��,,,,��,��,��,,,,,,��,,��,��,��,,,,,��,��,��,��,��,��,��,��,,��,��,,,,,,��,,�i���
�ڍ���,��,��,,��,,��,,��,��,��,��,��,��,��,��,��,��,��,��,��,,��,,,,,,��,,,,,,,��,��,��,,��,,,,,,,,��,��,,,,,,��,��,��,��,��,��,��,��,,��,,��,��,��,��,��,��,,�ڍ���
��c��,,,,,,,,,,,,,,,,,,,,,,,,,,,,,,,,,,,,,,,��,,��,,,,,,��,��,,,,,,��,��,��,,,,��,,,,,,��,��,,,��,,��c��
���c�J��,��,��,,��,,��,��,,��,��,,,��,��,,��,��,��,,,,,��,,,,,��,,,,��,��,,��,��,��,,��,,��,,,,,,��,��,��,,,,,��,��,��,��,��,��,��,,��,,,,,,,��,��,,���c�J��
�a�J��,��,��,,��,,��,,��,��,��,��,��,��,��,��,��,��,��,��,��,,��,,,,,,,��,,,,��,,��,��,,,��,,,,,,,,��,��,,,,,,��,��,��,,,,��,,,,,,��,,,,��,,�a�J��
�����,��,��,,,,��,,,,��,,��,��,,��,,,,,,��,,,,,,��,��,��,,,��,,,��,��,,��,��,,��,,,��,,,��,��,��,,,��,,��,��,��,��,��,,��,��,��,,,,��,,,��,��,,�����
������,��,��,,,,��,��,,��,��,��,,��,,,,��,��,,,,��,,,,,,��,��,,,��,��,��,,��,,��,��,,,,,��,,,��,��,��,,,,,��,��,��,,��,��,,,��,,,,��,,,,,��,������
�L����,��,��,,,,��,,,��,��,,��,,,,,,,,,,,,,,,,��,,,,��,��,,��,��,��,��,��,,,,,,,,��,,,,,��,��,��,��,��,��,��,,��,��,��,,,,��,��,,��,,,�L����
�k��,��,��,,��,,��,��,��,,��,,��,��,��,��,��,��,��,��,��,,��,,,,,,��,,,,��,,,,,��,,��,,,,,��,,,��,��,,,,,,��,��,��,��,��,,,,��,,,��,��,��,,��,��,,�k��
�r���,��,��,,,,��,,,,��,,,��,��,,,,��,,,,,,,,,,��,,,,��,,,,,��,,��,,��,��,,��,,,,��,��,��,,,��,��,��,��,��,��,��,��,��,��,,,��,��,��,��,��,,,�r���
����,��,��,��,��,��,��,��,��,��,��,,��,,,,,,,,,,��,,��,,,��,��,,,,��,��,,,��,��,��,��,��,,,,��,,,��,��,,,,,��,��,��,��,��,��,,��,,,��,,��,��,��,,��,,,����
���n��,��,��,��,��,��,��,��,��,��,��,,��,,,,,,,,,,��,,��,,,��,,,,,��,��,,,��,,��,��,,��,,,��,,,��,��,��,,,��,,��,��,��,��,��,,��,,��,,,,��,��,,��,��,��,���n��
������,��,��,��,��,��,��,��,��,��,��,,��,,,��,��,,��,,,,��,,��,,,��,��,,,,,,��,,��,��,��,��,��,��,,,��,,,��,��,��,,,,,��,��,��,��,��,,��,,��,,,��,��,��,,��,,,������
������,��,,,��,,��,,,,��,,,��,��,,��,��,��,��,��,,��,��,,,,,��,,,,��,,��,,��,��,,��,,,,,��,,,��,��,��,,,,,��,��,��,,��,,,,,,,,��,��,,��,,,������
�]�ː��,��,��,��,��,��,��,��,��,��,��,,,��,��,,��,��,��,,��,,��,��,,,,��,��,,,,��,��,,,��,��,��,��,,��,,,,,,��,��,,,,,,,��,��,��,��,,,��,,,��,��,��,��,,,��,,�]�ː��
�����q�s,��,��,��,��,��,��,��,��,��,��,,��,��,��,,��,,,,,,��,��,��,,,,��,,��,,��,,,��,��,,��,��,,,,,��,,,��,��,��,,,,,��,��,��,��,��,,��,��,��,,,��,��,,,��,��,,�����q�s
����s,��,��,��,��,��,��,��,��,,��,,��,,,��,,,,,,��,��,,��,,,,��,,,,��,,,,��,,��,��,,,,,,,,��,��,,,,��,,��,��,��,��,��,,��,,��,��,,��,��,,,��,��,,����s
������s,��,��,��,��,��,��,��,��,,��,,��,��,��,,��,��,��,,,,��,,��,,,,��,,,,��,,,,��,,,��,,,,,,,,��,��,,,,,,��,��,��,��,��,,,��,��,,,,,,,��,,,������s
�O��s,��,��,��,��,��,��,��,��,,��,,��,��,��,,��,,��,,,,��,��,,��,��,,��,,,,��,,��,,,��,,��,,��,,,��,,,��,��,��,,,,,��,��,��,��,��,,��,��,,,,��,��,,,��,��,,�O��s
�~�s,��,��,��,��,��,��,��,��,��,��,,��,,,,,,,,,,��,,��,,,,��,,,,,��,,,��,,��,��,,,,,,,,��,��,��,,,,,��,��,��,��,,,,,,,,,��,,,��,,,�~�s
�{���s,��,��,��,��,��,��,��,��,,��,��,��,,��,,,��,��,,��,,��,,,,,,��,,,,��,,,,��,,,��,,,,,,,,��,,,,,��,,��,��,��,,��,,��,,��,,,,,,,,,,�{���s
�����s,��,,��,��,��,,��,��,��,,,,,,,,,,,,,��,,��,,,,��,,,,��,,,,��,,,��,,,,,,,,��,��,,,,,,��,��,��,,,,,��,,,,,,,,,,,�����s
���z�s,��,��,��,��,��,��,��,��,��,,,,,,,,,,,,,��,��,,,,��,��,��,,,��,,,,��,��,,��,,,,,,,,��,��,,,,,��,��,��,��,��,��,,��,��,,,,,��,,,��,,,���z�s
���c�s,��,��,,��,��,��,��,��,��,��,,��,��,,,��,��,��,,,,��,,,,,,��,��,,,��,,��,,��,,��,��,,,,,,,,��,��,,,,,,��,��,��,��,��,��,,��,��,,,��,��,,,,��,��,���c�s
������s,��,��,��,��,,��,,��,,��,��,��,��,��,,��,��,��,,��,,��,,,,,,��,,,,��,,,,��,,,��,,,,,,,,��,��,��,,,,,��,��,��,��,��,,��,��,,,,��,��,,,��,,,������s
�����s,��,��,,��,��,��,,,,��,��,��,��,,,,,,,,��,��,��,��,,,,,,,,��,,,,��,��,,��,,,,,,,,,��,,,,,,,��,��,��,��,,��,,,,,,��,,,,,,�����s
����s,,,,,,,,,,,,,,,,,,,,,,,��,,,,,,��,��,��,��,,,,,,,��,,��,��,��,��,,,��,��,��,,��,,,��,��,��,��,��,,,��,,��,,��,��,,,,,,����s
�����R�s,��,��,,,,��,,,��,,,,,,,,,,,,,,,,,,,��,,,,��,,,,��,,,��,,��,��,,��,,,��,��,��,,��,,,��,��,��,,,,,,,,,,,,,��,,,�����R�s
�������s,��,��,,��,,��,��,��,��,,,,,,,,,,,,,��,��,,,,,��,,,,��,,,,��,��,,��,,,,,,,,��,��,,,,��,,,��,��,��,��,,��,��,,,,��,��,,,��,,,�������s
�����s,��,��,��,��,��,��,��,��,��,��,,��,,,,,,,,,,��,,��,,,��,��,,,,,��,,,��,,,��,,��,,,,,,��,��,,,,,,,��,��,,,,,��,,,,,,,,,��,,�����s
�����s,��,��,,,,��,,,,��,��,��,��,��,,,,��,,,,,,,,,,��,��,,,��,��,��,,��,��,,��,,,,,,,,��,,,,,,,��,��,��,,,,,,,,,,,,,��,,,�����s
���]�s,��,��,��,��,��,��,��,��,��,��,,��,��,��,��,,,��,,,��,��,��,��,��,,,��,,,,��,��,,,��,��,,��,,��,��,,��,,,��,��,��,,��,��,,��,��,��,��,��,,��,��,,,,,��,,,��,,,���]�s
����a�s,��,��,��,��,��,��,��,��,��,��,,��,,,��,,,,,,,,,,,,,��,,,,,,,,��,,,��,,,,,,,,��,,,,,��,,��,��,��,��,��,,��,,,,,,,,,,��,,����a�s
�����s,,,,,,,,,,,,,,,,,,,,,,,,,,,,,,,,,,,,,,,��,,��,��,,��,,,��,��,��,,,,,��,��,��,,��,,,��,,,,��,��,,,,,,�����s
���v���Ďs,��,��,,,,��,,,��,,,,,,,,,,,,,,��,,,��,,��,��,,,��,,,,��,��,,��,,,,,,,,��,��,,,,,,��,��,��,,��,,��,,,,,,��,,,,,,���v���Ďs
�������R�s,��,,,,,,,,,��,,,,,,,,��,,,,,��,,,,,��,,,,,,��,,,��,,��,,,,,��,,,��,��,��,,,,,��,��,��,��,,��,��,,,,,��,,,,��,,,�������R�s
�����s,��,��,��,��,��,��,��,��,,��,��,��,��,,,��,��,��,,,��,��,��,,,,,��,��,,,��,,,,��,��,,��,,��,��,,��,,,��,��,��,��,,��,,��,��,��,,,,��,,,,,,��,,,��,,,�����s
���s,��,��,��,��,��,��,��,��,,��,��,��,,,,��,��,��,,,��,��,��,,,,,��,��,,,��,,,,,��,��,��,,,,,,,,��,,,,,,,,��,��,��,��,,,,,,,��,��,,,��,,,���s
�H���s,��,��,,,,��,,,,,��,��,,,,,,,,,,,��,,,,,��,,,,��,,,,��,��,,��,,,,,,,,��,��,,,,,,��,��,��,,,,,,,,,,,,,��,,,�H���s
�������s,��,��,��,��,��,��,��,��,��,��,,��,,,,,,,,,��,��,,��,,,,��,,,,��,,,,��,,,��,,,,,��,,,��,��,��,,,,,��,��,��,,��,,��,,,,,,,,,��,,,�������s
�������s,��,��,��,��,��,��,��,��,��,��,,,��,��,,��,,,,,,��,��,,��,��,,��,,,,��,,,,��,��,,��,,��,��,��,��,,,��,��,��,,,,,��,��,��,��,��,,,��,,��,,,��,,,,,,�������s
���䒬,,,,,,,,,,,,,,,,,,,,,,,,,,,,,,,,,,,,,,,,,,,,,,,��,,,,,,,��,��,��,��,,,,,,,,,,,,,,,���䒬
���̏o��,,,,,,,,,,,,,,,,,,,,,,,,,,,,,,,,,,,,,,,��,,,,,,,,��,,,,,,,��,��,��,,,,,,,,,,,,,,,,���̏o��
�w����,,,,,,,,,,,,,,,,,,,,,,,,,,,,,,,,,,,,,,,��,,,,,,,,,,,,,,,��,��,��,,,,,,,,,,,,,,,,�w����
��������,,,,,,,,,,,,,,,,,,,,,,,,,,,,,,,,,,,,,,,��,,,,,,,,��,,,,,,,��,��,��,,,,,,,,,,,,,,,,��������
�哇��,��,,,,,��,,,��,,,,,,,,,,,,,��,,,,,,��,,,,��,,,,,��,,,,,,,,,,,,,,,,,��,��,��,,,,,,,,,,,,,,,,�哇��
������,,,,,,,,,,,,,,,,,,,,,,,,,,,,,,,,,,,,,,,,,,,,,,,,,,,,,,,,��,,,,,,,,,,,,,,,,������
�V����,,,,,,,,,,,,,,,,,,,,,,,,,,,,,,,,,,,,,,,,,,,,,,,,,,,,,,��,��,��,,,,,,,,,,,,,,,,�V����
�_�Ó���,,,,,,,,,,,,,,,,,,,,,,,,,,,,,,,,,,,,,,,,,,,,,,,,,,,,,,��,,��,,,,,,,,,,,,,,,,�_�Ó���
�O�,,,,,,,,,,,,,,,,,,,,,,,,,,,,,,,,,,,,,,,��,,,,,,,,,��,,,,,,,,��,,,,,,,,,,,,,,,,�O�
�䑠����,,,,,,,,,,,,,,,,,,,,,,,,,,,,,,,,,,,,,,,,,,,,,,,,,,,,,,��,,��,,,,,,,,,,,,,,,,�䑠����
���䓇��,,,,,,,,,,,,,,,,,,,,,,,,,,,,,,,,,,,,,,,,,,,,,,,,,,,,,,��,��,��,,,,,,,,,,,,,,,,���䓇��
������,,,,,,,,,,,,,,,,,,,,,,,,,,,,,,,,,,,,,,,,,,,,,,,,,,,,,,��,��,��,,,,,,,,,,,,,,,,������
���}����,,,,,,,,,,,,,,,,,,,,,,,,,,,,,,,,,,,,,,,,,,,,,,,,,,,,,,,��,��,,,,,,,,,,,,,,,,���}����
